{"text_format":"1","workbook":"xlsx","n_sheets":10,"sheets":["NCCPA Assessment Questionnaire","Loan Affordability Calculator","Living Expenses Worksheet","Self-employed Income","Investment Properties","LAC Guide","LAC Instructions","Calculations","Symtrix Maintenance RQD","Historical HEM Data"],"not_rendered":{"charts":2,"images":3,"macros":1,"external_links":1,"defined_names":37,"comments":2,"pivot_tables":0},"unopened":[],"bounds":{"document_bytes":16777216,"sheet_cells":100000,"rows_first":2000,"rows_last":500,"rows_between":2000,"halvings":0,"cell_chars":16384,"cell_head_chars":4096},"cells_cut":0,"cells_raw":0,"read":"whole","date_system":"1900"}

{"sheet":"NCCPA Assessment Questionnaire","index":0,"n_rows":37,"n_cols":10,"rows_kept":37,"cut":false,"hidden":false,"merged":[[26,9,26,10],[0,0,0,12],[3,0,4,12],[6,9,6,10],[15,9,15,10],[24,9,24,10],[18,2,19,8],[20,2,22,8]]}
["NCCPA Assessment Questionnaire                             "]
[]
[]
["This assessment is to determine if the borrower/credit facility is protected by the NCCPA requirements, as per the Responsible Lending obligations."]
[]
[]
[null,null,"Question 1"]
[null,null,"Is the applicant a natural person or a strata corporation?"]
[null,null,"A natural person includes (but is not limited to):"]
[null,null,"     - an individual"]
[null,null,"     - individuals in a Partnership"]
[null,null,"     - an individual as Trustee for a Trust"]
[]
[]
[]
{"$rows_left_out":23}
{"sheet":"Loan Affordability Calculator","index":1,"n_rows":167,"n_cols":31,"rows_kept":167,"cut":false,"hidden":false,"merged":[[0,10,0,18],[0,0,0,6],[125,1,126,1],[1,0,1,6],[5,0,5,6],[2,1,2,5],[3,1,3,5],[4,1,4,5],[1,10,1,16],[7,0,7,1],[7,4,7,5]]}
["                         Loan Affordability Calculator",null,null,null,null,null,null,null,null,null,"Existing Mortgage Commitments "]
[]
["Applicant Name/s",null,null,null,null,null,null,null,null,null,"Does the member have existing mortgages","No"]
["Customer Number/s"]
["Application Number",null,null,null,null,null,null,null,null,null,"Loan Type","Other ADI Rate","Sensitivity Margin","Sensitised Rate","Minimum Floor Rate "]
[null,null,null,null,null,null,null,null,null,null,"Residential",0,0.03,{"$f":"L6+M6","v":0.03},5.5E-2]
["INCOME"," ",null,null,null,null,null,null,null,null,"Commercial Floor Rate",0,0.03,{"$f":"L7+M7","v":0.03},7.4999999999999997E-2]
["Household 1",null,null,null,"Household 2",null,null,null,null,null,null,0]
["Applicant 1",null,null,null,"Applicant 3"]
["Gross Annual Income",null,null,null,"Gross Annual Income",null,null,null,null,null,"Existing Mortgage Loans"]
["Gross Non-standard Income ",null,null,null,"Gross Non-standard Income ",null,null,null,null,null,"Financial Institution","Security Type","Balance","Redraw Available","Total Loan","Minimum monthly repayment","Interest Rate ","Months Remaining","Forecast payout date"]
["Gross Annual Rental Income",{"$f":"(Calculations!B66)","v":0},null,null,"Gross Annual Rental Income",{"$f":"(Calculations!D66)","v":0},null,null,null,null,null,null,0,0,{"$f":"M12+N12","v":0},0,0,{"$f":"IF(K12=0,(\"\"),(NPER(Q12/12,P12,-O12,0)))","v":""},{"$f":"IF(K12=0,(\"\"),(DATE(YEAR($F$63),MONTH($F$63)+R12,DAY($F$63))))","v":""}]
["Shaded Annual Rental Income",{"$f":"B12*Inc_Scaling","v":0},null,null,"Shaded Annual Rental Income",{"$f":"F12*Inc_Scaling","v":0},null,null,null,null,null,null,0,0,0,0,0,"",{"$f":"IF(K13=0,(\"\"),(DATE(YEAR($F$63),MONTH($F$63)+R13,DAY($F$63))))","v":""}]
["Non Taxable Annual Income",null,null,null,"Non Taxable Annual Income",null,null,null,null,null,null,null,0,0,0,0,0,"",{"$f":"IF(K14=0,(\"\"),(DATE(YEAR($F$63),MONTH($F$63)+R14,DAY($F$63))))","v":""}]
["Medicare Levy",{"$f":"(B10+B11+B13)*Medicare_Levy","v":0},null,null,"Medicare Levy",{"$f":"(F10+F11+F13)*Medicare_Levy","v":0},null,null,null,null,null,null,0,0,0,0,0,"",""]
{"$rows_left_out":153}
{"sheet":"Living Expenses Worksheet","index":2,"n_rows":79,"n_cols":20,"rows_kept":79,"cut":false,"hidden":false,"merged":[[79,0,79,1],[0,0,0,5]]}
["             Living Expenses Worksheet",null,null,null,null,null,null,null,null,null,null,null,null,"Annually","Annual","Weekly","Annually",1]
[null,null,null,null,null,"Monthly Total",null,null,null,null,null,null,null,"Quarterly","Quarterly","Fortnightly","Fortnightly",26]
["Transport and Vehicle Expenses",null,null,null,null,{"$f":"SUM(F4:F12)","v":0},null,null,null,null,null,null,null,"Monthly","Monthly","Monthly","Monthly",12]
["Vehicle registration",null,null,"Annually",null,{"$f":"IF(D4=\"\",\"\",(B4*VLOOKUP(D4,$Q$1:$R$5,2)/VLOOKUP($Q$3,$Q$1:$R$5,2)))","v":0},null,null,null,null,null,null,null,"Weekly","Weekly","Quarterly","Quarterly",4]
["Vehicle maintenance ",null,null,"Annually",null,0,null,null,null,null,null,null,null,"Fortnightly","Fortnightly","Annually","Weekly",52]
["Vehicle insurance",null,null,"Annually",null,0]
["Motorcycle registration and insurance ",null,null,"Annually",null,0,null,null,null,null,null,null,null,null,null,"Monthly sum"]
["Caravan / trailer registration and insurance",null,null,"Annually",null,0,null,null,null,null,null,null,null,{"$f":"A3","v":"Transport and Vehicle Expenses"},null,{"$f":"F3+B82","v":0}]
["Watercraft registration and insurance",null,null,"Annually",null,0,null,null,null,null,null,null,null,{"$f":"A13","v":"Property Expenses"},null,{"$f":"F13-F18-F19+B83","v":0},"Rent / Board",{"$f":"F18+F19+B93","v":0}]
["Petrol",null,null,"Weekly",null,{"$f":"IF(D10=\"\",\"\",(B10*VLOOKUP(D10,$Q$1:$R$5,2)/VLOOKUP($Q$3,$Q$1:$R$5,2)))","v":0},null,null,null,null,null,null,null,{"$f":"A21","v":"Services and Utilities"},null,{"$f":"F21+B84","v":0}]
["Public Transport",null,null,"Annually",null,0,null,null,null,null,null,null,null,{"$f":"A29","v":"Food and Groceries"},null,{"$f":"F29+B85","v":0}]
["Other Transport and Vehicle expenses",null,null,"Annually",null,{"$f":"IF(D12=\"\",\"\",(B12*VLOOKUP(D12,$Q$1:$R$5,2)/VLOOKUP($Q$3,$Q$1:$R$5,2)))","v":0},null,null,null,null,null,null,null,{"$f":"A34","v":"Recreation and Entertainment"},null,{"$f":"F34+B86","v":0}]
["Property Expenses",null,null,null,null,{"$f":"SUM(F14:F20)","v":0},null,null,null,null,null,null,null,{"$f":"A39","v":"Child Expenses"},null,{"$f":"F39-F40-F45+B87","v":0},"Child Support",{"$f":"F45+B90","v":0},"Private School",{"$f":"F40+B92","v":0}]
["Council Rates",null,null,"Annually",null,{"$f":"IF(D14=\"\",\"\",(B14*VLOOKUP(D14,$Q$1:$R$5,2)/VLOOKUP($Q$3,$Q$1:$R$5,2)))","v":0},null,null,null,null,null,null,null,{"$f":"A47","v":"Health and Wellbeing"},null,{"$f":"F47-F50-F51+B88","v":0},"Life and Health Ins",{"$f":"F50+F51+B91","v":0}]
["Body Corporate fees",null,null,"Annually",null,{"$f":"IF(D15=\"\",\"\",(B15*VLOOKUP(D15,$Q$1:$R$5,2)/VLOOKUP($Q$3,$Q$1:$R$5,2)))","v":0},null,null,null,null,null,null,null,"Other Living Expenses",null,{"$f":"F53+B89","v":0}]
{"$rows_left_out":65}
{"sheet":"Self-employed Income","index":3,"n_rows":44,"n_cols":10,"rows_kept":44,"cut":false,"hidden":false,"merged":[[0,0,0,9],[7,8,9,8],[7,9,9,9],[2,1,2,8],[3,1,3,8],[4,1,4,8]]}
["               Self-employed Income Assessment"]
[]
["Entity Name/s",{"$f":"'Loan Affordability Calculator'!B3:F3","v":0}]
["Customer Number/s",{"$f":"'Loan Affordability Calculator'!B4:F4","v":0}]
["Application Number",{"$f":"'Loan Affordability Calculator'!B5:F5","v":0}]
[]
[]
[null,null,"Most recent year",null,"Prior year 1",null,"Prior year 2",null,"Variance between most recent and prior year 1","Variance between previous year 1 and prior year 2"]
["Financial year",null," "]
[]
["Self-employed income"]
["Gross Profit",null,0,null,0,null,0,null,{"$f":"SUM(E12-C12)","v":0},{"$f":"SUM(G12-E12)","v":0}]
[]
["Less Expenses",null,0,null,0,null,0,null,{"$f":"SUM(E14-C14)","v":0},{"$f":"SUM(G14-E14)","v":0}]
[]
{"$rows_left_out":30}
{"sheet":"Investment Properties","index":4,"n_rows":73,"n_cols":23,"rows_kept":73,"cut":false,"hidden":false,"merged":[]}
["Investment Properties"]
["Applicant 1",null,null,null,null,"Applicant 2",null,null,null,null,"Applicant 3",null,null,null,null,"Applicant 4"]
["Property Information ",null,null,null,null,"Property Information ",null,null,null,null,"Property Information ",null,null,null,null,"Property Information ",null,null,null,null,null,"Expense benchmark",{"$f":"Calculations!K10","v":0}]
["Property reference ",null,null,null,null,"Property reference ",null,null,null,null,"Property reference ",null,null,null,null,"Property reference "]
["Rental Income per month",null,null,null,null,"Rental Income per month",null,null,null,null,"Rental Income per month",null,null,null,null,"Rental Income per month"]
["Ownership Percentage",null,null,null,null,"Ownership Percentage",null,null,null,null,"Ownership Percentage",null,null,null,null,"Ownership Percentage"]
["Balance of investment loan",null,null,null,null,"Balance of investment loan",null,null,null,null,"Balance of investment loan",null,null,null,null,"Balance of investment loan"]
["Loan interest rate",null,null,null,null,"Loan interest rate",null,null,null,null,"Loan interest rate",null,null,null,null,"Loan interest rate"]
["Property Expenses",null,null,null,null,"Property Expenses",null,null,null,null,"Property Expenses",null,null,null,null,"Property Expenses"]
[" ",null," ",null,null," ",null," ",null,null," ",null," ",null,null," ",null," "]
["Council Rates",null,"Annually",null,null,"Council Rates",null,"Annually",null,null,"Council Rates",null,"Annually",null,null,"Council Rates",null,"Annually"]
["Body Corporate fees",null,"Annually",null,null,"Body Corporate fees",null,"Annually",null,null,"Body Corporate fees",null,"Annually",null,null,"Body Corporate fees",null,"Annually"]
["Landlord insurances",null,"Annually",null,null,"Landlord insurances",null,"Annually",null,null,"Landlord insurances",null,"Annually",null,null,"Landlord insurances",null,"Annually"]
["Maintenance",null,"Annually",null,null,"Maintenance",null,"Annually",null,null,"Maintenance",null,"Annually",null,null,"Maintenance",null,"Annually"]
["Management Fees",null,"Annually",null,null,"Management Fees",null,"Annually",null,null,"Management Fees",null,"Annually",null,null,"Management Fees",null,"Annually"]
{"$rows_left_out":59}
{"sheet":"LAC Guide","index":5,"n_rows":29,"n_cols":4,"rows_kept":29,"cut":false,"hidden":true,"merged":[[17,0,18,0],[2,0,3,0],[2,1,3,1],[4,0,5,0],[6,1,7,1],[8,0,9,0]]}
["Term","Definition",null,"Basic Living Expenses"]
["Living Expenses","Necessary cost of living includes food, entertainment, vehicle expenses, PPR utilities, boat/caravan expenses, investment house expenses."]
["Declared Living Expenses","Value of living expenses declared by applicants to cover necessary cost of living expenses as listed above"]
[]
["Benchmark Living Expenses previously referred to as Standard Living Expenses","Value of living expenses adopted by QCCU based on Household Expenditure Measure (HEM) using various family unit types (e.g. couple +1) and indexed according to income brackets.",null,"Discretionary / additional expenses"]
[null,"Benchmark living expenses includes food, expenses for 1 vehicle and PPR utilities, additional vehicles (including boats & bikes) and investment properties are to be added as necessary."]
["Other Household Expenses","Other Expenses includes rent/board, child support, day care and private school fees, other child expenses, health insurance,  insurance (personal) , debts with ATO, SPER, holidays"]
["previously referred to as Discretionary Expenses"]
["Commitments","Repayments on existing mortgage loans, personal loans, credit cards, store cards.  The repayments as detailed in the loan contract should be input in the LAC, it should not include any additional payments made at the discretion of the debtor."]
[null,"Provision to include Rent /Board."]
[]
["Living Expenses","Covers and includes"]
["Food & Groceries","Groceries, butcher, take- away, coffee, work lunches"]
["Entertainment & Recreation","Restaurants, events, birthdays, presents, alcohol, memberships/subscriptions (e.g. gym, golf, magazines)"]
["Vehicle Expenses","Insurance, fuel, registration, servicing, repairs, tyres"]
{"$rows_left_out":15}
{"sheet":"LAC Instructions","index":6,"n_rows":83,"n_cols":8,"rows_kept":83,"cut":false,"hidden":false,"merged":[[70,0,77,0],[78,0,82,0],[58,0,62,0],[69,0,69,3],[63,0,68,0],[0,0,0,3],[1,0,1,3],[41,0,41,3],[56,0,56,3],[2,0,2,3],[13,0,22,0],[23,0,28,0],[29,0,32,0],[33,0,40,0],[42,0,55,0],[5,0,12,0]]}
["LAC Instructions and Information"]
["Refer to applicable section for further details of the input and information required to calculate loan affordability.        \n\nThis instruction and information does not replace policy. Always refer to applicable policies as the source of truth.\n\nRefer to Branch Lending Policy 0300, Business and Commercial Lending Policy 0600, for accurate and up to date restrictions and requirements. \n\nRefer to Acceptable Income Guide GUD 0375 for details on acceptable income calculation methods.  "]
["Loan Affordability "]
[null,"Type and Input","Information ","Verification / Details"]
["NCCPA","NCCPA Assessment Questionnaire","Questionnaire is to be completed to deterime if NCCPA Act applies to the credit facility.  Credit Facility is protected by the NCCPA if it is a regualted facility.","Completed Questionnaire"]
["Income ","Gross Annual Income","Enter base wage or salary","Pay advices, PAYG Summaries/Income Statements, Tax Return "]
[null,"Gross Non-standard Income ","Enter permissible non-standard income shaded to 80%","Non-standard income includes overtime, allowances and must be verified per policy to include in income assessment"]
[null,"Gross Annual Rental Income","Total gross income received from Rental ","Refer to GUD 0702 Minimum Supporting Document Guide - Rental Income"]
[null,"Net Monthly Income","Net income is your take home pay after taxes and other payroll deductions.","Verification of payslips i.e. take home pay (net Income)"]
[null,"Non Taxable Annual Income","Annual Income that is deemed tax free","Examples include government allowances, carer payments, rent assistance, child support payments etc.                        "]
[null,"Net Monthly Non Taxable ","Income earned monthly that is deemed tax free","As Above"]
[null,"Self-employed Income","Self Employed Income is derived from business activities where the member works for themselves or contracts","Refer to GUD 0702 Minimum Supporting Document Guide - Sole Traders, Partnership and Contractors"]
[null,"Total Monthly Income",null,"All Monthly income that is being used for servicing.      \n              \nHousehold 1 includes applicant 1, applicant 2, and self-employed income.\n\nHousehold 2 includes applicant 3 and applicant 4 income."]
["Expenses","Declared Living Expenses (monthly)","Enter Members declared living expenses into the Living Expenses section. ","Statement history, Member advised"]
[null,"Investment Property Expenses in Excess of 20%","Enter Actual Investment property expenses into the Investment property tab.\nA minimum of 20% of Gross Rental Income will be removed from Net Income to account for expenses. Actual Expenses above 20% of Gross Rental Income will be carried over to Other Household Expenses \n*please note that these amounts are calculated per property.\n","Actual investment property expenses, ie: Tax return, rates notices, body corporate, levies, insurances, etc."]
{"$rows_left_out":69}
{"sheet":"Calculations","index":7,"n_rows":77,"n_cols":30,"rows_kept":77,"cut":false,"hidden":true,"merged":[]}
["Income",null,null,null,null,null,null,null,null,"Other Expenses",null,null,null,null,null,"Other Living ","Security Type",null,"Living Expenses",null,"Named Range Lists",null,null,"Term"]
[null,null,null,null,null,null,null,null,null,"No of Children",{"$f":"IF('Loan Affordability Calculator'!B46=0,0,IF('Loan Affordability Calculator'!B46=1,250,IF('Loan Affordability Calculator'!B46=2,500,IF('Loan Affordability Calculator'!B46=3,750,IF('Loan Affordability Calculator'!B46=4,1000,IF('Loan Affordability Calculator'!B46=5,1250,IF('Loan Affordability Calculator'!B46=6,1500,IF('Loan Affordability Calculator'!B46=7,1750))))))))","v":0},null,null,null,null,"Child Support","Residential",null,"Single",null,"Months in Year","MiY",12,180]
[null,null,null,null,"Calculated Tax Rate %","Gearing Tax Adjustment ","Gearing Position",null,null,"Additional Vehicle",{"$f":"IF('Loan Affordability Calculator'!B47=1,230,IF('Loan Affordability Calculator'!B47=2,460,IF('Loan Affordability Calculator'!B47=3,690,IF('Loan Affordability Calculator'!B47=4,920,IF('Loan Affordability Calculator'!B47=5,1150,)))))","v":0},null,null,null,null,"Private School Fees","Commercial",null,"Single plus 1",null,"Income Scaling","Inc_Scaling",0.8,300]
["Applicant 1 T.G.A.I.",{"$f":"'Loan Affordability Calculator'!B12*Inc_Scaling+'Loan Affordability Calculator'!B10+'Loan Affordability Calculator'!B11","v":0},"Applicant 1 Adjusted T.G.A.I.",{"$f":"B4-B5","v":0},null,null,null,"Gross Self Employed",{"$f":"'Self-employed Income'!C37","v":0},"Motorbike",{"$f":"IF('Loan Affordability Calculator'!B48=1,160,IF('Loan Affordability Calculator'!B48=2,320,IF('Loan Affordability Calculator'!B48=3,480,IF('Loan Affordability Calculator'!B48=4,640,))))","v":0},null,null,null,null,"Child Expenses",null,null,"Single plus 2",null,"Expenses Minimum","Exp_Min",0.2]
["NegativeGearingPerAnnum",{"$f":"SUMIFS('Investment Properties'!E:E,'Investment Properties'!D:D,\"NegativeGearingPerAnnum\", 'Investment Properties'!E:E,\"<0\")*-1","v":0},"Applicant 1 Tax",{"$f":"IF(D4<=18200,0,IF(D4<=45000,(((D4-18200)*19%)),IF(D4<=120000,((((D4-45000)*32.5%)+5092)),IF(D4<=180000,((((D4-120000)*37%)+29467)),IF(D4>180000,((((D4-180000)*45%)+51667)))))))+(D4*Medicare_Levy)","v":0},{"$f":"IF(D4<=18200,\"0\",IF(D4<=45000,\"19\",IF(D4<=120000,\"32.5\",IF(D4<=180000,\"37\",IF(D4>180000,\"45\")))))","v":"0"},{"$f":"B5*(E5/100)","v":0},{"$f":"IF(F5=0,\"Positive Gearing\",\"Negative Gearing\")","v":"Positive Gearing"},null,null,"Boat/Jet Ski",{"$f":"IF('Loan Affordability Calculator'!B49=1,120,IF('Loan Affordability Calculator'!B49=2,240,IF('Loan Affordability Calculator'!B49=3,360,IF('Loan Affordability Calculator'!B49=4,480,))))","v":0},null,null,null,null,"Medical Expenses",null,null,"Single plus 3",null,"Medicare_Levy","Medicare_Levy",0.02]
["Applicant 2 T.G.A.I.",{"$f":"'Loan Affordability Calculator'!B21*Inc_Scaling+'Loan Affordability Calculator'!B19+'Loan Affordability Calculator'!B20","v":0},"Applicant 2 Adjusted T.G.A.I.",{"$f":"B6-B7","v":0},null,null,null,null,null,"Total Expenses",{"$f":"SUM(K2+K3+K4+K5+T30)","v":0},null,null,null,null,"Health Insurance",null,null,"Couple"]
["NegativeGearingPerAnnum",{"$f":"SUMIFS('Investment Properties'!J:J,'Investment Properties'!I:I,\"NegativeGearingPerAnnum\", 'Investment Properties'!J:J,\"<0\")*-1","v":0},"Applicant 2 Tax",{"$f":"IF(D6<=18200,0,IF(D6<=45000,(((D6-18200)*19%)),IF(D6<=120000,((((D6-45000)*32.5%)+5092)),IF(D6<=180000,((((D6-120000)*37%)+29467)),IF(D6>180000,((((D6-180000)*45%)+51667)))))))+(D6*Medicare_Levy)","v":0},{"$f":"IF(D6<=18200,\"0\",IF(D6<=45000,\"19\",IF(D6<=120000,\"32.5\",IF(D6<=180000,\"37\",IF(D6>180000,\"45\")))))","v":"0"},{"$f":"B7*(E7/100)","v":0},{"$f":"IF(F7=0,\"Positive Gearing\",\"Negative Gearing\")","v":"Positive Gearing"},null,null,null,null,null,null,null,null,"Other Personal Insurance",null,null,"Couple plus 1",null,null,null," "]
["Applicant 3 T.G.A.I.",{"$f":"'Loan Affordability Calculator'!F12*Inc_Scaling+'Loan Affordability Calculator'!F10+'Loan Affordability Calculator'!F11","v":0},"Applicant 3 Adjusted T.G.A.I.",{"$f":"B8-B9","v":0},null,null,null,null,null,null,null,null,null,null,null,"ATO or SPER debts",null,null,"Couple plus 2"]
["NegativeGearingPerAnnum",{"$f":"SUMIFS('Investment Properties'!O:O,'Investment Properties'!N:N,\"NegativeGearingPerAnnum\", 'Investment Properties'!O:O,\"<0\")*-1","v":0},"Applicant 3 Tax",{"$f":"IF(D8<=18200,0,IF(D8<=45000,(((D8-18200)*19%)),IF(D8<=120000,((((D8-45000)*32.5%)+5092)),IF(D8<=180000,((((D8-120000)*37%)+29467)),IF(D8>180000,((((D8-180000)*45%)+51667)))))))+(D8*Medicare_Levy)","v":0},{"$f":"IF(D8<=18200,\"0\",IF(D8<=45000,\"19\",IF(D8<=120000,\"32.5\",IF(D8<=180000,\"37\",IF(D8>180000,\"45\")))))","v":"0"},{"$f":"B9*(E9/100)","v":0},{"$f":"IF(F9=0,\"Positive Gearing\",\"Negative Gearing\")","v":"Positive Gearing"},null,null,null,null,null,null,null,null,null,null,null,"Couple plus 3"]
["Applicant 4 T.G.A.I.",{"$f":"'Loan Affordability Calculator'!F21*Inc_Scaling+'Loan Affordability Calculator'!F19+'Loan Affordability Calculator'!F20","v":0},"Applicant 4 Adjusted T.G.A.I.",{"$f":"B10-B11","v":0},null,null,null,null,null,"Investment property expense benchmark:",0]
["NegativeGearingPerAnnum",{"$f":"SUMIFS('Investment Properties'!T:T,'Investment Properties'!S:S,\"NegativeGearingPerAnnum\", 'Investment Properties'!T:T,\"<0\")*-1","v":0},"Applicant 4 Tax",{"$f":"IF(D10<=18200,0,IF(D10<=45000,(((D10-18200)*19%)),IF(D10<=120000,((((D10-45000)*32.5%)+5092)),IF(D10<=180000,((((D10-120000)*37%)+29467)),IF(D10>180000,((((D10-180000)*45%)+51667)))))))+(D10*Medicare_Levy)","v":0},{"$f":"IF(D10<=18200,\"0\",IF(D10<=45000,\"19\",IF(D10<=120000,\"32.5\",IF(D10<=180000,\"37\",IF(D10>180000,\"45\")))))","v":"0"},{"$f":"B11*(E11/100)","v":0},{"$f":"IF(F11=0,\"Positive Gearing\",\"Negative Gearing\")","v":"Positive Gearing"},null,null,null,null,null,null,null,null,null,null,null," "]
["Net Income Applicant 1",{"$f":"(B4-D5)/12+B18","v":0}]
["Net Income Applicant 2",{"$f":"(B6-D7)/12+B20","v":0}]
["Net Income Applicant 3",{"$f":"(B8-D9)/12+B22","v":0}]
["Net Income Applicant 4",{"$f":"(B10-D11)/12+B24","v":0},null,null,null,null,null,null,null,null,null,null,null,null,null,"Health Insurance"]
{"$rows_left_out":63}
{"sheet":"Symtrix Maintenance RQD","index":8,"n_rows":54,"n_cols":14,"rows_kept":54,"cut":false,"hidden":true,"merged":[[16,13,16,15]]}
["Car Expenses",null,null,"Actual Living Expenses"]
["4 Cylinder",190,null,"Living Expenses"]
["6 Cylinder",255,null,"Household Insurance"]
["8 Cylinder",310,null,"Health Ins"]
["Average",{"$f":"AVERAGE(B2:B4)","v":251.66666666666666},null,"Pay TV"]
["Utilised",230,null,"Rates"]
[null,null,null,"Private School Fees"]
[null,null,null,"Other"]
[null,null,null,"Contents"]
[null,null,null,"Expense Adjustment"]
[]
[]
[]
["Living Arrangements Type","No. of Dependents","Amount","Living Arrangements Type","No. of Dependents","Amount","Living Arrangements Type","No. of Dependents","Amount","Living Arrangements Type","No. of Dependents","Amount"]
["Single Rentor-Inc <$60k",0,{"$f":"C38","v":0},"Single Rentor-Inc <$60k",1,{"$f":"C39","v":0},"Single Rentor-Inc <$60k",2,{"$f":"C40","v":0},"Single Rentor-Inc <$60k",3,{"$f":"C41","v":0},null,"Symtrix updated 1/03/2017"]
{"$rows_left_out":40}
{"sheet":"Historical HEM Data","index":9,"n_rows":9,"n_cols":5,"rows_kept":9,"cut":false,"hidden":true,"merged":[]}
["Living Expenses","Sep-18 Qtr","Jun-18 Qtr","Mar-18 Qtr","Dec-17 Qtr"]
["Single",314,312,299,284]
["Single plus 1",429,421,{"$f":"D2+65","v":364},371]
["Single plus 2",498,476,{"$f":"D3+65","v":429},420]
["Single plus 3",525,517,{"$f":"D4+65","v":494},510]
["Couple",615,597,565,558]
["Couple plus 1",794,753,{"$f":"D6+117","v":682},695]
["Couple plus 2",901,874,{"$f":"D7+117","v":799},804]
["Couple plus 3",957,949,{"$f":"D8+117","v":916},873]